STREET,911,NAME,ADDRESS,CITY,ST,ZIP,LOCA A,LOCA B,TAX MAP,DESCRIP,SALE,BK,PG,REC,SCH CODE,STATUS,SPAN,GLCODE,OWN CD,ACRE,GL VALUE,HOME,HOUSE,VET EXEMPT
ABBIE LN,3,JACKSON TRACEY L & ERDO DANIEL Z,27 WHITE BIRCH RD,REDDINIG,CT,06896,HOUSE AND LAND,CHIMNEY HILL C-167,00CHC167.000,HOUSE AND LAND,"$178,000",278,503-504,  -   -,242,A,762-242-10293,R1,NS,1,"$178,500",$0,$0,0
ABBIE LN,4,MILLER KENNETH & VERA,PO BOX 925,WILMINGTON,VT,05363-0925,HOUSE AND LAND,CHIMNEY HILL C-151,00CHC151.000,HOUSE AND LAND,"$140,000",317,191,12-Mar-15,242,A,762-242-11327,R1,T,1,"$188,000","$188,000","$188,000",0
ABBIE LN,8,WOMACK KERRI T & CHRISTOPHER C,11 DOE DR,COLUMBIA,NJ,07832,HOUSE AND LAND,CHIMNEY HILL C-152,00CHC152.000,HOUSE AND LAND,"$163,000",317,530,03-Apr-15,242,A,762-242-10344,R1,NS,1,"$190,000",$0,$0,0
ABBIE LN,9,NATOLI NOEL & GALLAGHER TIMOTHY,43-10 CRESCENT ST APT 2816,LONG ISLAND CITY,NY,11101-4284,HOUSE AND LAND,CHIMNEY HILL C-159,00CHC159.000,HOUSE AND LAND,"$194,000",327,296,  -   -,242,A,762-242-12339,R1,NS,1,"$210,000",$0,$0,0
ABBIE LN,12,MESITE ROBERT,64 CHARING RD,SOUTH WINDSOR,CT,06074,HOUSE AND LAND,CHIMNEY HILL C-153,00CHC153.000,HOUSE AND LAND,"$340,000",260,295-296,  -   -,242,A,762-242-11441,R1,NS,1,"$320,000",$0,$0,0
ABBIE LN,15,SWEETING JAMES E & AMY B,179 NORTH WHITNEY ST,AMHERST,MA,01002,HOUSE AND LAND,CHIMNEY HILL C-158,00CHC158.000,HOUSE AND LAND,"$190,000",331,7,19-Dec-16,242,A,762-242-12024,R1,NS,1,"$210,000",$0,$0,0
ABBIE LN,18,DEJOHN EUGENE G & PAUL & BENJAMIN,73 BUCKS CROSSING,ROCKY HILL,CT,06067,HOUSE AND LAND,CHIMNEY HILL C-154/INC C-156,00CHC154.000,HOUSE AND LAND,"$342,857",311,522,13-Jun-14,242,A,762-242-11010,R1,NS,1.5,"$220,000",$0,$0,0
ADAMS DR,10,LANE BROTHERS LLC,10 ADAMS DR,WILMINGTON,VT,05363,HOUSE AND LAND & BUSINESS,,02120012.000,HOUSE AND LAND & BUSINESS/INC. 21-20-11,"$240,000",309,556,  -   -,242,A,762-242-11957,C,C,1.4,"$275,000","$275,000","$137,500",0
ALDRICH RD,17,TUCKER ELENI DATED 1/19/07TR,131 CANOE BROOK RD,TRUMBULL,CT,06611,HOUSE AND LAND,ALDRICH FARM COR,00602035.000,HOUSE AND LAND,$0,285,426-427,  -   -,242,A,762-242-13242,R1,NS,5.66,"$270,000",$0,$0,0
ALDRICH RD,21,SCHINDEL ANDREW M & ROSALIE TRSTEES,21 ALDRICH RD,WILMINGTON,VT,05363,HOUSE AND LAND,,00602036.000,HOUSE AND LAND-INC. 6-2-24 & 6-2-25,$0,304,299-301,  -   -,242,A,762-242-12866,R2,T,43.46,"$625,000","$625,000","$460,000",0
ALDRICH RD,24,ROUSSEAU PETER R & KHIN ZAR,PO BOX 905,WILMINGTON,VT,05363-0905,HOUSE AND LAND,,00602032.000,HOUSE AND LAND-INC 6-2-96,"$270,000",216,334,  -   -,242,A,762-242-13223,R1,T,5.9,"$425,000","$425,000","$410,000",0
ALDRICH RD,29,HAYFORD LELAND G & CINDY C,PO BOX 63,WILMINGTON,VT,05363-0063,HOUSE AND LAND,ALDRICH ROAD OFF OF RAY HILL,00602027.200,HOUSE AND LAND,$0,,,  -   -,242,A,762-242-11585,R1,T,2.6,"$385,000","$385,000","$380,000",0
ALDRICH RD,33,ANDREWS LORI J,33 ALDRICH RD,WILMINGTON,VT,05363-9773,HOUSE AND LAND,ALDRICH ROAD #3,00602028.000,HOUSE AND LAND,"$44,000",191,438,  -   -,242,A,762-242-12931,R1,T,2.52,"$330,000","$323,600","$320,600",0
ALDRICH RD,43,MARVIN PATRICK W & HOLLY,86 BAYVIEW AVE,PORT WASHINGTON,NY,11050,HOUSE AND LAND,,00602026.000,HOUSE AND LAND-INC 6-2-27.3 LOT #2A,"$305,000",295,286-289,  -   -,242,A,762-242-11439,R2,NS,12.26,"$315,000",$0,$0,0
ALDRICH RD,52,DUNCAN RYAN R,PO BOX 685,WILMINGTON,VT,05363-0685,HOUSE AND LAND,,00602029.000,HOUSE AND LAND,"$185,000",313,444,01-Oct-14,242,A,762-242-10882,R1,T,2.1,"$190,000","$190,000","$185,000",0
ALDRICH RD,57,TONON PAUL & MARY BETH,57 ALDRICH RD,WILMINGTON,VT,05363-9773,HOUSE AND LAND,,00602001.200,HOUSE AND LAND-INC 6-2-1.1& 6-2-27.1,"$592,000",218,561,  -   -,242,A,762-242-11173,R2,T,22.96,"$605,000","$605,000","$475,000",0
ALDRICH RD,72,GREENSPAN ALAN S & ALICE B TR,PO BOX 938,WILMINGTON,VT,05363-0938,HOUSE AND LAND,,00602097.000,HOUSE AND LAND/INC 2-3-13.2,$0,274,329-330,  -   -,242,A,762-242-11467,R2,T,23.6,"$560,000","$560,000","$470,000",0
ARCTIC CIR,13,BAYLIS RAYMOND & MELISSA,8 CONCORD DR,SHAMONG,NJ,08088,HOUSE AND LAND,CHIMNEY HILL M-61/INC M-57,00CHM061.000,HOUSE AND LAND,$0,266,460-462,  -   -,242,A,762-242-10170,R1,NS,2,"$198,000",$0,$0,0
ARCTIC CIR,15,LUBIN KEVIN,PO BOX 1834,WILMINGTON,VT,05363-1834,HOUSE AND LAND,CHIMNEY HILL M-59,00CHM059.000,HOUSE AND LAND,$0,239,565,  -   -,242,A,762-242-12273,R1,T,1,"$260,000",$0,$0,0
ARCTIC CIR,19,GOODERMOTE COREY S & CRAIG M,C/O P & A GOODERMOTE PO BOX 1124,WILMINGTON,VT,05363-1124,HOUSE AND LAND,CHIMNEY HILL M-65,00CHM065.000,HOUSE AND LAND,$0,338,344,  -   -,242,A,762-242-10007,R1,T,1,"$209,000","$209,000","$209,000",0
ARCTIC CIR,20,PERUN JOSEPH & ROBERT & SHAUNA,28 CHARCOAL RIDGE RD WEST,NEW FAIRFIELD,CT,06812,HOUSE AND LAND,CHIMNEY HILL M-66,00CHM066.000,HOUSE AND LAND,"$132,278",339,577,20-Apr-18,242,A,762-242-13017,R1,NS,1,"$300,000",$0,$0,0
ARCTIC CIR,22,HARRON LAWRENCE E & MARY S,237 BUCKSKIN PATH,CENTERVILLE,MA,02632,HOUSE AND LAND,CHIMNEY HILL M-64,00CHM064.000,HOUSE AND LAND,"$131,500",184,331,  -   -,242,A,762-242-11551,R1,NS,1,"$205,000",$0,$0,0
ARCTIC CIR,23,O'CONNELL CRAIG & ANN,15 MIDDLE RD,HAMDEN,CT,06517,HOUSE AND LAND,CHIMNEY HILL M-67,00CHM067.000,HOUSE AND LAND,"$170,000",223,114,  -   -,242,A,762-242-11806,R1,NS,1,"$160,000",$0,$0,0
ARCTIC CIR,29,BURT WILLIAM J & LILLIAN M,RACE BROOK RD,WOODBRIDGE,CT,06525,HOUSE AND LAND,CHIMNEY HILL M-69/INC M-68,00CHM069.000,HOUSE AND LAND,$0,,,  -   -,242,A,762-242-10412,R1,NS,2,"$210,000",$0,$0,0
ARCTIC CIR,31,HILTZ ELLIS A JR & DAWN P,25 SHRUB OAK LN,FAIRFIELD,CT,06824,HOUSE AND LAND,CHIMNEY HILL M-70/INC M-72,00CHM070.000,HOUSE AND LAND,"$329,000",230,2,  -   -,242,A,762-242-12105,R1,NS,2,"$295,000",$0,$0,0
ARCTIC CIR,40,LISH DONNA L,129 CENTER ST,CLINTON,NJ,08809-1338,HOUSE AND LAND,CHIMNEY HILL M-73,00CHM073.000,HOUSE AND LAND,$0,293,37-38,  -   -,242,A,762-242-12026,R1,NS,1,"$140,000",$0,$0,0
ARCTIC CIR,41,NORDFORS JEFFREY A & JEAN M,121 OLD WOOD LN,BOONTON,NJ,07005,HOUSE AND LAND,CHIMNEY HILL M-74,00CHM074.000,HOUSE AND LAND,"$273,000",235,489,  -   -,242,A,762-242-10469,R1,NS,1,"$225,000",$0,$0,0
ATHERTON RD,8,GATTI ROBERT W,8 ATHERTON RD,WILMINGTON,VT,05363,CAMP AND LAND,,00304059.000,CAMP AND LAND-INC 3-4-29,$0,,,  -   -,242,A,762-242-11336,S2,T,17.52,"$80,000","$80,000","$70,000",0
ATHERTON RD,19,BOLOGNANI ROBERT & PATTI JEAN,19 ATHERTON RD,WILMINGTON,VT,05363,HOUSE AND LAND,,00304061.000,HOUSE AND LAND,$0,,,  -   -,242,A,762-242-10291,R1,T,1,"$230,000","$230,000","$230,000",0
ATHERTON RD,32,JACOBS REGINALD & GENEVIEVE,42 ATHERTON RD,WILMINGTON,VT,05363,CAMP AND LAND,,00304058.000,CAMP AND LAND,$0,,,  -   -,242,A,762-242-11750,S1,T,2.9,"$50,000",$0,$0,0
ATHERTON RD,37,JOYCE BENJAMIN A & BEECK SIEGLINDE L,37 ATHERTON RD,WILMINGTON,VT,05363-9620,HOUSE AND LAND,,00304062.000,HOUSE AND LAND,$0,,,  -   -,242,A,762-242-11799,R1,T,2,"$360,000","$360,000","$360,000",0
ATHERTON RD,42,JACOBS REGINALD & GENEVIEVE,42 ATHERTON RD,WILMINGTON,VT,05363,HOUSE AND LAND,,00304057.000,HOUSE AND LAND,$0,,,  -   -,242,A,762-242-11749,R1,T,1.5,"$150,000","$150,000","$150,000",0
ATHERTON RD,59,NEUMAN SUSAN L,59 ATHERTON RD,WILMINGTON,VT,05363-9620,HOUSE AND LAND,,00304030.100,HOUSE AND LAND,$0,,,  -   -,242,A,762-242-12411,R1,T,3.31,"$375,000","$375,000","$365,000",0
ATHERTON RD,68,FAUST JERRY & LISCUM LAURA E,256 PINE ST,QUINCY,MA,02170,HOUSE AND LAND,,00304030.120,HOUSE AND LAND,"$285,000",316,409,02-Feb-15,242,A,762-242-12012,R1,NS,2,"$285,000",$0,$0,0
ATHERTON RD,78,ATHERTON STEWART & LOUISE,78 ATHERTON RD,WILMINGTON,VT,05363,MOBILE HOME AND LAND,ATHERTON RD,00304056.000,MOBILE HOME AND LAND,$0,,,  -   -,242,A,762-242-10098,R1,T,2.8,"$70,000","$70,000","$65,000",0
ATHERTON RD,83,RYSZ PETER,87 BAKER BROOK RD,WILLIAMSVILLE,VT,05362,HOUSE AND LAND,ATHERTON ROAD - EAST SIDE,00304089.000,HOUSE AND LAND,"$30,000",337,488,29-Nov-17,242,A,762-242-12276,R1,S,1.1,"$145,000",$0,$0,0
BALLOU HILL RD,22,WURZBERGER ALBERT II,PO BOX 2459,BRATTLEBORO,VT,05303,HOUSE AND LAND,,00701059.000,HOUSE AND LAND/INC 7-1-58,"$18,000",212,342,  -   -,242,A,762-242-11064,R2,T,21.5,"$275,000","$275,000","$245,000",0
BALLOU HILL RD,27,PARK PETER & MICHELLE,PO BOX 392,WILMINGTON,VT,05363-0392,HOUSE AND LAND,,00701065.100,HOUSE AND LAND,$0,,,  -   -,242,A,762-242-12528,R2,T,7.57,"$360,000","$360,000","$340,000",0
BALLOU HILL RD,35,SPOONER CHAD J,20 WALNUT RIDGE LN,STAMFORD,CT,06905,HOUSE AND LAND,,00701065.200,HOUSE AND LAND,$0,341,4,06-Jun-18,242,A,762-242-11699,R2,NS,11.26,"$355,000",$0,$0,0
BALLOU HILL RD,49,JONES SAM & BRITNY,PO BOX 111,WILMINGTON,VT,05363-0111,HOUSE AND LAND,,00701064.000,HOUSE AND LAND,"$240,000",320,370,24-Aug-15,242,A,762-242-11653,R2,T,10.3,"$240,000","$240,000","$230,000",0
BALLOU HILL RD,64,MERRICK FRANK B & SUSAN,20 PROSPECT ST,SUMMIT,NJ,07901,HOUSE AND LAND,BALLOU HILL #7,00701061.000,HOUSE AND LAND INC 7-1-60.100,$0,,,  -   -,242,A,762-242-12266,R2,NS,16.72,"$545,000",$0,$0,0
BALLOU HILL RD,104,MILLAR JAMES M & PITNEY ALEXANDRA C,33 MONROE AVE,LARCHMONT,NY,10538,HOUSE AND LAND,,00701062.100,HOUSE AND LAND,$0,312,471,  -   -,242,A,762-242-13370,R2,NS,6.77,"$625,000",$0,$0,0
BALLOU HILL RD,105,AMES FAMILY IRREVO TRST THE,406 WAREHAM,MIDDLEBORO,MA,02346,CAMP AND LAND,BALLOU HILL,00701063.000,CAMP AND LAND,"$112,000",334,576,17-Jul-17,242,A,762-242-13216,S1,NS,2.75,"$117,000",$0,$0,0
BALLOU HILL RD,136,SELLEI AGNES,31 DURHAM RD,LONGMEADOW,MA,01106,HOUSE AND LAND,,02320029.000,HOUSE AND LAND/INC. 23-20-31 & 7-1-50,$0,,,  -   -,242,A,762-242-12910,R2,NS,66.6,"$420,000",$0,$0,0
BALLOU HILL RD,142,JACKSON ARTHUR & JESSICA,309 RIVER RD,SOUTH HADLEY,MA,01075,HOUSE AND LAND,,02320028.000,HOUSE AND LAND,"$235,000",330,194,21-Nov-16,242,A,762-242-11457,R1,NS,2.2,"$270,000","$270,000","$268,000",0
BALLOU HILL RD,155,PLUMB JASON L & KIMBERLY A,18 WESTLAND AVE,W HARTFORD,CT,06107-2732,HOUSE AND LAND,WOODS LANDING/BALLOU HILL #3 & #4,02320033.000,HOUSE AND LAND,"$275,000",280,546,  -   -,242,A,762-242-11398,R2,NS,42.35,"$330,000",$0,$0,0
BALLOU HILL RD,156,MOTTA PETER H & DIANE J TRUSTEES,PO BOX 802,WILMINGTON,VT,05363-0802,HOUSE AND LAND,BALLOU HILL #2,02320027.000,HOUSE AND LAND,$0,,,  -   -,242,A,762-242-12364,R1,T,1.9,"$315,000",$0,$0,0
BALLOU HILL RD,179,LONGO THOMAS & STACEY L,179 BALLOU HILL RD,WILMINGTON,VT,05363,HOUSE AND LAND,BALLOU HILL RD,02320034.000,HOUSE AND LAND,"$365,000",291,215-217,  -   -,242,A,762-242-10806,R2,T,16.6,"$390,000","$390,000","$365,000",0
BALLOU HILL RD,186,STANTON JOHN F & GERALDINE V,89 CEDAR AVE,MAYWOOD,NJ,07607,HOUSE AND LAND,,02320025.000,HOUSE AND LAND,$0,,,  -   -,242,A,762-242-13055,R1,NS,3.9,"$300,000",$0,$0,0
BALLOU HILL RD,200,GORE SALLY L TRST,PO BOX 11,WILMINGTON,VT,05363-0011,HOUSE AND LAND,,02320035.000,HOUSE AND LAND,"$220,000",328,304,09-Sep-16,242,A,762-242-11413,R2,T,12,"$230,000","$230,000","$220,000",0
BALLOU HILL RD,213,MCSHARRY MATTHEW & HOLLY IZANT,10 DIALSTONE LN,RIVERSIDE,CT,06878,HOUSE AND LAND,BALLOU HILL - GREEN MT LAKES #6,02320040.000,HOUSE AND LAND,"$370,000",213,189,  -   -,242,A,762-242-11181,R2,NS,12.2,"$405,000",$0,$0,0
BALLOU HILL RD,219,STEWART H WILLIAM III & LAINA B,PO BOX 1620,WILMINGTON,VT,05363-1620,HOUSE AND LAND,,02320041.000,HOUSE AND LAND,"$337,000",276,84-85,  -   -,242,A,762-242-12696,R2,T,11.77,"$340,000","$207,250","$192,250",0
BALLOU HILL RD,220,JACOBSON ERIC K,220 BALLOU HILL RD,WILMINGTON,VT,05363,HOUSE AND LAND,GM LAKES #5,02320024.000,HOUSE AND LAND,"$202,500",338,79,21-Dec-17,242,A,762-242-13020,R1,T,2.2,"$220,000","$220,000","$219,000",0
BEAR LAIR LN,2,MCCONNELL JAMES & SHEILA H,PO BOX 638,WILMINGTON,VT,05363-0638,HOUSE AND LAND,CHIMNEY HILL M-387,00CHM387.000,HOUSE AND LAND,$0,,,  -   -,242,A,762-242-12204,R1,T,1,"$360,000","$360,000","$360,000",0
BEAR LAIR LN,6,SALTZMAN DEAN A & ELSA,40 SEAMAN AVE,ROCKVILLE CTR,NY,11570,HOUSE AND LAND,CHIMNEY HILL M-388,00CHM388.000,HOUSE AND LAND,"$118,000",325,365,10-May-16,242,A,762-242-13074,R1,NS,1,"$125,000",$0,$0,0
BEAR LAIR LN,7,BUTTINGER KENNETH ALLEN & MARGARET JANE,4 FAWN TRAIL,OLD LYME,CT,06371,HOUSE AND LAND,CHIMNEY HILL M-385,00CHM385.000,HOUSE AND LAND,"$145,000",225,565,  -   -,242,A,762-242-11855,R1,NS,1,"$245,000",$0,$0,0
BEAR LAIR LN,8,DURKEE STEVEN T &  ET AL,70 FLAGLER AVE,CHESHIRE,CT,06410,HOUSE AND LAND,CHIMNEY HILL M-389,00CHM389.000,HOUSE AND LAND,$0,,,  -   -,242,A,762-242-11118,R1,NS,1,"$185,000",$0,$0,0
BEAR LAIR LN,16,LEES WILLIAM R JR,PO BOX 1644,WILMINGTON,VT,05363-1644,HOUSE AND LAND,CHIMNEY HILL M-359/INC M-358,00CHM359.000,HOUSE AND LAND,"$192,500",311,85,  -   -,242,A,762-242-10803,R1,T,2,"$195,000","$195,000","$195,000",0
BEAR LAIR LN,20,JACKSON TIMOTHY S & KERRI L,4 WILLOW BROOK LN,NEWTON,CT,06470,HOUSE AND LAND,CHIMNEY HILL M-361,00CHM361.000,HOUSE AND LAND,"$192,000",324,60,18-Feb-16,242,A,762-242-12138,R1,NS,1,"$150,000",$0,$0,0
BEAR LAIR LN,26,PARIGIAN THOMAS,20 MAHORAS DRIVE,OCEAN,NJ,08226,HOUSE AND LAND,CHIMNEY HILL M-362,00CHM362.000,HOUSE AND LAND,$0,,,  -   -,242,A,762-242-12527,R1,NS,1,"$260,000",$0,$0,0
BEAR LAIR LN,42,DUPUIS DANIEL & MELANIE,4021 THISTLE CREEK CT,NAPLES,FL,34119,HOUSE AND LAND,CHIMNEY HILL M-374,00CHM374.000,HOUSE AND LAND,$0,311,478,02-Jun-14,242,A,762-242-11807,R1,NS,1,"$295,000",$0,$0,0
BEAR LAIR LN,43,SCHULTZ SUZANNE,120 FAN HILL RD,MONROE,CT,06468,HOUSE AND LAND,CHIMNEY HILL M-379/INC M-380,00CHM379.000,HOUSE AND LAND,"$118,000",307,556-557,27-Nov-13,242,A,762-242-13117,R1,NS,2,"$150,000",$0,$0,0
BEAR LAIR LN,46,WARGO PETER J & MARGARET E,230 WEST 107TH ST APT 5F,NEW YORK,NY,10025,HOUSE AND LAND,CHIMNEY HILL M-376/INC CHM377,00CHM376.000,HOUSE AND LAND,"$122,000",180,83,  -   -,242,A,762-242-13351,R1,NS,2,"$175,000",$0,$0,0
BEARCROFT LN,27,SPILLER MARK S & DONNA,PO BOX 994,WILMINGTON,VT,05363-0994,HOUSE AND LAND,,01001008.000,HOUSE AND LAND,"$15,000",182,185,  -   -,242,A,762-242-13027,R2,T,10.5,"$110,000","$110,000","$100,000",0
BEAU RIDGE RD,42,BEAUDETTE LOUIS A & CYNTHIA,PO BOX 937,WILMINGTON,VT,05363-0937,HOUSE AND LAND,KFOURY ROAD (OFF STOWE HILL),00602013.000,HOUSE AND LAND,$0,,,  -   -,242,A,762-242-10174,R2,T,7,"$560,000","$560,000","$535,000",0
BEAU RIDGE RD,80,HELFENSTEIN HUGH & JULIET TRUSTEE,PO BOX 1056,WILMINGTON,VT,05363-1056,HOUSE AND LAND,,00602010.000,HOUSE AND LAND-INC 6-2-11,$0,214,300,  -   -,242,A,762-242-11616,R2,T,10.1,"$310,000","$310,000","$280,000",0
BEAU RIDGE RD,89,AMODEO APRIL B,18 SMITHBROOK TERR,GLASTONBURY,CT,06033,HOUSE AND LAND,LOT #3,00602017.300,HOUSE AND LAND,"$342,000",283,167-168,  -   -,242,A,762-242-10298,R2,NS,10.2,"$460,000",$0,$0,0
BEAU RIDGE RD,107,HALPERT DAVID & LEZANA HALPERT V M,17 FERNBEL LN,WEST HARTFORD,CT,06107,HOUSE AND LAND,STOWE HILL - KFOURY DEV #4,00602009.000,HOUSE AND LAND,"$215,000",324,273,15-Mar-16,242,A,762-242-10373,R2,NS,10.1,"$265,000",$0,$0,0
BEAU RIDGE RD,151,COLE DAVID & JANICE ET AL,12 WILD APPLE LANE,OLD SAYBROOK,CT,06475,HOUSE AND LAND,,00602017.100,HOUSE AND LAND,$0,331,114,06-Jan-17,242,A,762-242-10780,R2,NS,10.03,"$276,000",$0,$0,0
BEAU RIDGE RD,171,BUHLER WARREN & HELEN,12 DE GARMO PL,POUGHKEEPSIE,NY,12601,HOUSE AND LAND,STOWE HILL - #8 KFOURY DEV,00602017.400,HOUSE AND LAND,"$380,000",272,92-93,  -   -,242,A,762-242-12260,R2,NS,10.1,"$380,000",$0,$0,0
BEAU RIDGE RD,178,GILBERG ELLEN F,462 GLEN MEADOW LN,NAPLES,FL,34105,HOUSE AND LAND,,00602016.000,HOUSE AND LAND-INC 6-2-17.500,$0,,,  -   -,242,A,762-242-11363,R2,NS,20.5,"$305,000",$0,$0,0
BEAU RIDGE RD,188,SKEADAS PETER J & APHRODITE ET AL,564 STANWICH AVE,GREENWICH,CT,06831,HOUSE AND LAND,STOWE HILL - LOT 9 KFOURY DEV,00602017.200,HOUSE AND LAND,"$300,000",212,400,  -   -,242,A,762-242-12623,R2,NS,10.1,"$305,000",$0,$0,0
BEAU RIDGE RD,215,R F P REAL ESTATE FAM LMTD PRTSHP,240 BYRAM LAKE RD,BEDFORD CORNERS,NY,10549-4720,HOUSE AND LAND,STOWE HILL,00602017.610,HOUSE AND LAND,$0,277,33-36,  -   -,242,A,762-242-10302,R2,NS,20.3,"$575,000",$0,$0,0
BEAVER ST,5,HALL ALLEN N,PO BOX 373,WILMINGTON,VT,05363-0373,HOUSE AND LAND,BEAVER STREET - WEST SIDE,02022026.000,HOUSE AND LAND,$0,180,115,  -   -,242,A,762-242-11520,R1,T,0.25,"$125,000","$125,000","$125,000",0
BEAVER ST,6,GRINOLD ROBERT & ADAM,210 VT RTE 9 EAST,WILMINGTON,VT,05363,HOUSE AND LAND,BEAVER & CHURCH ST,02022025.000,HOUSE AND LAND,"$189,900",240,399,  -   -,242,A,762-242-12633,CA,T,0.32,"$180,000",$0,$0,0
BEAVER ST,9,ERHARD EDWARD J III,70-09 73RD PL,GLENDALE,NY,11385,HOUSE AND LAND,BEAVER ST - W SIDE,02022027.000,HOUSE AND LAND,$0,,,  -   -,242,A,762-242-11161,R1,NS,0.25,"$160,000",$0,$0,0
BEAVER ST,11,LAVOY RAYMOND TRSTEE REVO TR,PO BOX 386,WILMINGTON,VT,05363-0386,HOUSE AND LAND,,02022028.000,HOUSE AND LAND,$0,319,353,24-Jun-15,242,A,762-242-11976,R1,T,0.1,"$78,000","$78,000","$78,000",0
BEAVER ST,13,CLEOS LLC,210 VT RTE 9 E,WILMINGTON,VT,05363,HOUSE AND LAND,BEAVER STREET,02022029.000,HOUSE AND LAND,"$100,000",267,359-360,  -   -,242,A,762-242-11521,C,C,0.33,"$205,000",$0,$0,0
BEAVER ST,18,WILMINGTON TOWN OF,PO BOX 217,WILMINGTON,VT,05363-0217,BUILDING & LAND - FIRE HOUSE,BEAVER & CHURCH STREETS,02122016.000,BUILDING & LAND - FIRE HOUSE,$0,,,  -   -,242,A,762-242-13471,C,T,0.3,"$566,594",$0,$0,0
BEAVER ST,19,LIBBY MARGARET,19 BEAVER ST,WILMINGTON,VT,05363,HOUSE AND LAND,,02122023.000,HOUSE AND LAND,$0,,,  -   -,242,A,762-242-12015,R1,T,0.15,"$85,000","$85,000","$85,000",0
BEAVER ST,21,GRINOLD ROBERT,210 RTE 9 E,WILMINGTON,VT,05363,HOUSE AND LAND,BEAVER STREET,02122024.000,HOUSE AND LAND,$0,,,  -   -,242,A,762-242-11486,R1,T,0.27,"$185,000",$0,$0,0
BEAVER ST,40,WILMINGTON TOWN OF,PO BOX 217,WILMINGTON,VT,05363-0217,LAND ONLY,SCHOOL AND BEAVER STS,02122022.000,LAND ONLY,$0,,,  -   -,242,A,762-242-13472,C,T,1.5,"$35,000",$0,$0,0
BEEBE RD,12,ONEILL THEODORE G & KERI,317 EDWARD ST,FAIRFIELD,CT,06824-6704,HOUSE AND LAND,CHIMNEY HILL B-34,00CHB034.000,HOUSE AND LAND,"$225,000",246,132,  -   -,242,A,762-242-11719,R1,NS,1,"$215,000",$0,$0,0
BEEBE RD,21,WILSON DUNCAN AD&MURRAY MARY ELIZABETH,21 RIDGECREST W,SCARSDALE,NY,10583-2046,HOUSE AND LAND,,00601035.000,HOUSE AND LAND,$0,,,  -   -,242,A,762-242-13491,R1,NS,2,"$198,000",$0,$0,0
BEEBE RD,27,FERRUCCI ANDREA M,27 BEEBE RD,WILMINGTON,VT,05363-9766,HOUSE AND LAND,,00601034.000,HOUSE AND LAND,"$130,000",295,396-397,  -   -,242,A,762-242-11149,R1,T,1,"$125,000","$125,000","$125,000",0
BEEBE RD,34,RIZIO JESSICA A,PO BOX 1284,WILMINGTON,VT,05363-1284,HOUSE AND LAND,BEEBE RD,00501003.200,HOUSE AND LAND,$0,298,560-561,07-Nov-12,242,A,762-242-12748,R2,T,11,"$295,000","$295,000","$270,000",0
BEEBE RD,49,FITZGERALD JENNIFER REVO TRUST,PO BOX 58,WILMINGTON,VT,05363-0058,HOUSE AND LAND,,00501003.100,HOUSE AND LAND,$0,301,317-318,  -   -,242,A,762-242-11229,R2,T,158.1,"$465,000","$465,000","$255,000",0
BIG BEND LOOP,3,TRAVIS SARAH,301 E 79TH ST APT 11B,NEW YORK,NY,10075,HOUSE AND LAND,CHIMNEY HILL M-128/INC M-129,00CHM128.000,HOUSE AND LAND,"$290,000",333,581,22-May-17,242,A,762-242-12306,R1,NS,2,"$238,000","$238,000","$238,000",0
BIG BEND LOOP,8,SOBOLEWSKI MATTHEW D & JANE E,30 OUTLOOK CIR,LARCHMONT,NY,10538,HOUSE AND LAND,CHIMNEY HILL M-167/INC M-168,00CHM167.000,HOUSE AND LAND,"$635,000",333,360,03-May-17,242,A,762-242-10608,R1,NS,2,"$330,000",$0,$0,0
BIG BEND LOOP,12,COGDILL CHRISTOPHER D & MAIONE F J,92 BAYFIELD RD NORTH,QUINCY,MA,02171,HOUSE AND LAND,CHIMNEY HILL M-165/INC CHM-166,00CHM165.000,HOUSE AND LAND,"$174,500",325,494,20-May-16,242,A,762-242-10894,R1,NS,2,"$162,000",$0,$0,0
BIG BEND LOOP,13,SCHILDKRAUT DAVID S & COLLETTE,122 COLONIAL RD,GREAT NECK,NY,11021,HOUSE AND LAND,CHIMNEY HILL M-131/INC M-130,00CHM131.000,HOUSE AND LAND,"$220,000",336,4,19-Sep-17,242,A,762-242-11732,R1,NS,2,"$215,000",$0,$0,0
BIG BEND LOOP,16,MARTIN  RAYOND III & D'ANGELICA ALANA,19 COLONIAL RD UNIT #8,STAMFORD,CT,06906,HOUSE AND LAND,CHIMNEY HILL M-164,00CHM164.000,HOUSE AND LAND,"$175,000",337,51,26-Oct-17,242,A,762-242-13097,R1,NS,1,"$194,500",$0,$0,0
BIG BEND LOOP,21,PETERSON JEFFERY& ANGELA,47 BURLINGTON DR,FEEDING HILLS,MA,01030,HOUSE AND LAND,CHIMNEY HILL M-134,00CHM134.000,HOUSE AND LAND,"$127,000",338,34,18-Dec-17,242,A,762-242-12998,R1,NS,1,"$141,500",$0,$0,0
BIG BEND LOOP,30,MOFFITT MICHELLE,PO BOX 894,WILMINGTON,VT,05363-0894,HOUSE AND LAND,CHIMNEY HILL M-160,00CHM160.000,HOUSE AND LAND,$0,238,23,  -   -,242,A,762-242-12312,R1,T,1,"$255,000","$255,000","$255,000",0
BIG BEND LOOP,31,SCHUBERT SPENCER A & SARA K,45 HEATHER DR,NEW CANAAN,CT,06840,HOUSE AND LAND,CHIMNEY HILL M-136//INC M-137,00CHM136.000,HOUSE AND LAND,"$340,500",329,3,04-Oct-16,242,A,762-242-10601,R1,NS,2,"$245,000",$0,$0,0
BIG BEND LOOP,41,SMITH JAMES,PO BOX 7722,HICKSVILLE,NY,11802-7722,HOUSE AND LAND,CHIMNEY HILL M-141/WAS CHM-404,00CHM141.000,HOUSE AND LAND,$0,283,20-21,  -   -,242,A,762-242-12987,R1,NS,1,"$155,000",$0,$0,0
BIG BEND LOOP,47,GOLUB BENJAMIN J,C/O ROSEN 5 GRACEMERE LAKE DR,TARRYTOWN,NY,10591,HOUSE AND LAND,CHIMNEY HILL M-143/ INC M-142,00CHM143.000,HOUSE AND LAND,$0,,,  -   -,242,A,762-242-11400,R1,NS,2,"$255,000",$0,$0,0
BIG BEND LOOP,49,KELAPIRE ANDREW & ANGELA,3 WHITE DEER CT,HUNTINGTON,NY,11743,HOUSE AND LAND,CHIMNEY HILL M-424,00CHM424.000,HOUSE AND LAND,"$177,000",318,390,14-May-15,242,A,762-242-12776,R1,NS,1,"$195,000",$0,$0,0
BIG BEND LOOP,52,BELLIVEAU MARC,115 SILO DR,ROCKY HILL,CT,06067,HOUSE AND LAND,CHIMNEY HILL M-156,00CHM156.000,HOUSE AND LAND,"$96,494",315,581,17-Dec-14,242,A,762-242-11178,R1,NS,1,"$199,000",$0,$0,0
BIG BEND LOOP,55,RODRIGUES MANUEL & MINERVA,131 OLD KINGS HIGHWAY,WILTON,CT,06897,HOUSE AND LAND,CHIMNEY HILL M-146,00CHM146.000,HOUSE AND LAND-INC CHM147,"$200,000",339,22,01-Mar-18,242,A,762-242-10788,R1,NS,2,"$214,000",$0,$0,0
BIG BEND LOOP,57,HIRONS JONATHAN P & JULIET,PO BOX 1026,WILMINGTON,VT,05363-1026,HOUSE AND LAND,CHIMNEY HILL M-149/INC M-148,00CHM149.000,HOUSE AND LAND,$0,221,413,  -   -,242,A,762-242-10758,R1,T,2,"$185,000","$185,000","$185,000",0
BIG BEND LOOP,73,EDMONDS CHRISTIAN P,PO BOX 807,BRANFORD,CT,06405,HOUSE AND LAND,CHIMNEY HILL M-552,00CHM552.000,HOUSE AND LAND,$0,,,  -   -,242,A,762-242-11135,R1,NS,1,"$185,000",$0,$0,0
BIG BEND LOOP,78,HWANG CINDY Y,48 W 68TH ST APT 2B,NEW YORK,NY,10023-6015,HOUSE AND LAND,CHIMNEY HILL M-186/INC M-185 & M-187,00CHM186.000,HOUSE AND LAND,$0,304,85-87,  -   -,242,A,762-242-10388,R1,NS,3,"$180,000",$0,$0,0
BIG BEND LOOP,81,TIERSTEN MICHAEL & CATHERINE,282 RICHMOND AVE,SOUTH ORANGE,NJ,07079,HOUSE AND LAND,CHIMNEY HILL M-930/INC CHM197,00CHM930.000,HOUSE AND LAND,$0,,,  -   -,242,A,762-242-13211,R1,NS,2,"$250,000",$0,$0,0
BIG BEND LOOP,90,NOISEUX KATHY,PO BOX 246,WILMINGTON,VT,05363-0246,HOUSE AND LAND,CHIMNEY HILL M-182,00CHM182.000,HOUSE AND LAND,$0,330,66,  -   -,242,A,762-242-11630,R1,T,1,"$155,000","$155,000","$155,000",0
BIG BEND LOOP,95,RICKER MARTIN & LISA,182 SMITH,FORT EWEN,NY,12466,HOUSE AND LAND,CHIMNEY HILL M-292/INC CHM201,00CHM292.000,HOUSE AND LAND,"$128,500",325,334,06-May-16,242,A,762-242-12346,R1,NS,2,"$133,500",$0,$0,0
BIG BEND LOOP,96,SANTUCCI ROBERT & LAUREN,23 FARM ST,MEDFIELD,MA,02052,HOUSE AND LAND,CHIMNEY HILL M-412,00CHM412.000,HOUSE AND LAND,"$155,000",340,455,29-May-18,242,A,762-242-10435,R1,NS,1,"$175,000",$0,$0,0
BINNEY BROOK RD,8,COHEN MICHELE & JACOBS HENDRIK,52 VAN ALLEN RD,GLEN ROCK,NJ,07452-1321,HOUSE AND LAND,CHIMNEY HILL M-634/INC CHM633,00CHM634.000,HOUSE AND LAND,"$154,500",208,46,  -   -,242,A,762-242-11765,R1,NS,2,"$155,000",$0,$0,0
BINNEY BROOK RD,20,SHEPARD JOHN,15 AMHERST DR,CHESHIRE,CT,06410,HOUSE AND LAND,CHIMNEY HILL M-632,00CHM632.000,HOUSE AND LAND,"$125,000",337,287,08-Nov-17,242,A,762-242-12936,R1,NS,1,"$128,000",$0,$0,0
BINNEY BROOK RD,34,FARRICIELLI MARIA,131 RABBIT RUN RD,SEWELL,NJ,08080,HOUSE AND LAND,,00CHM631.000,HOUSE AND LAND,"$214,500",284,448-449,  -   -,242,A,762-242-11912,R1,NS,1,"$215,000",$0,$0,0
BINNEY BROOK RD,38,KHAN CYNTHIA D & MICHAEL I,15 LANCELOT CT,SAINT JAMES,NY,11780,HOUSE AND LAND,CHIMNEY HILL M-630,00CHM630.000,HOUSE AND LAND,"$168,000",326,465,30-Jun-16,242,A,762-242-12225,R1,NS,1,"$175,000",$0,$0,0